Target
Epidermal growth factor receptor
Ligand
BDBM4296
Substrate
Meas. Tech.
ChEMBL_506200 (CHEMBL941404)
IC50
1000±n/a nM
Citation
 Chang, CJGeahlen, RL Protein-Tyrosine Kinase Inhibition: Mechanism-Based Discovery of Antitumor Agents J Nat Prod 55:1529-1560 (1992)  
Target
Name:
Epidermal growth factor receptor
Synonyms:
EGF Receptor Substrate EGFR_HUMAN ERBB1 Epidermal Growth Factor Receptor erbB-1 Epidermal growth factor receptor (EGFR) HER1 Proto-oncogene c-ErbB-1 Tyrosine-Protein Kinase ErbB-1
Type:
Receptor Kinase Domain
Mol. Mass.:
134279.59
Organism:
Homo sapiens (Human)
Description:
P00533
Residue:
1210
  
Inhibitor
Name:
BDBM4296
Synonyms:
(2E)-2-benzoyl-3-(3,4-dihydroxyphenyl)prop-2-enenitrile | Tyrphostin deriv. 29
Type:
Small organic molecule
Emp. Form.:
C16H11NO3
Mol. Mass.:
265.2634
SMILES:
Oc1ccc(\C=C(/C#N)C(=O)c2ccccc2)cc1O
: