Target
Disintegrin and metalloproteinase domain-containing protein 17
Ligand
BDBM26525
Substrate
Meas. Tech.
ChEMBL_496896 (CHEMBL1001173)
Ki
0.180000±n/a nM
Citation
 Mazzola, RDZhu, ZSinning, LMcKittrick, BLavey, BSpitler, JKozlowski, JNeng-Yang, SZhou, GGuo, ZOrth, PMadison, VSun, JLundell, DNiu, X Discovery of novel hydroxamates as highly potent tumor necrosis factor-alpha converting enzyme inhibitors. Part II: optimization of the S3' pocket. Bioorg Med Chem Lett 18:5809-14 (2009)  
Target
Name:
Disintegrin and metalloproteinase domain-containing protein 17
Synonyms:
ADA17_HUMAN CSVP Disintegrin and metalloproteinase domain-containing protein 17 (ADAM17) TNF-alpha convertase TNF-alpha-converting enzyme (TACE) Tumor necrosis factor-α converting enzyme (TACE)
Type:
Enzyme
Mol. Mass.:
93007.89
Organism:
Homo sapiens (Human)
Description:
Residue:
824
  
Inhibitor
Name:
BDBM26525
Synonyms:
(1S,2R)-1-N-hydroxy-2-({4-[(2-phenylquinolin-4-yl)methoxy]phenyl}methyl)cyclopropane-1,2-dicarboxamide | hydroxamate-cyclopropyl compound, 2
Type:
Small organic molecule
Emp. Form.:
C28H25N3O4
Mol. Mass.:
467.5158
SMILES:
NC(=O)[C@@]1(Cc2ccc(OCc3cc(nc4ccccc34)-c3ccccc3)cc2)C[C@@H]1C(=O)NO
: