Target
Glycogen synthase kinase-3 beta
Ligand
BDBM50293161
Substrate
Meas. Tech.
ChEMBL_496925 (CHEMBL1002020)
IC50
690±n/a nM
Citation
 Stevens, KLReno, MJAlberti, JBPrice, DJKane-Carson, LSKnick, VBShewchuk, LMHassell, AMVeal, JMDavis, STGriffin, RJPeel, MR Synthesis and evaluation of pyrazolo[1,5-b]pyridazines as selective cyclin dependent kinase inhibitors. Bioorg Med Chem Lett 18:5758-62 (2009)  
Target
Name:
Glycogen synthase kinase-3 beta
Synonyms:
GSK-3 beta GSK3B Glycogen synthase kinase 3 beta (GSK3B) Glycogen synthase kinase-3 beta (GSK-3B) Glycogen synthase kinase-3 beta (GSK3B) Glycogen synthase kinase-3beta (GSK3B) | Serine/threonine-protein kinase GSK3B
Type:
Enzyme
Mol. Mass.:
46756.38
Organism:
Homo sapiens (Human)
Description:
P49841
Residue:
420
  
Inhibitor
Name:
BDBM50293161
Synonyms:
1-(dimethylamino)-3-(4-(4-(6-morpholinopyrazolo[1,5-b]pyridazin-3-yl)pyrimidin-2-ylamino)phenoxy)propan-2-ol | CHEMBL521871
Type:
Small organic molecule
Emp. Form.:
C25H30N8O3
Mol. Mass.:
490.5575
SMILES:
CN(C)CC(O)COc1ccc(Nc2nccc(n2)-c2cnn3nc(ccc23)N2CCOCC2)cc1
: