Target
Cyclin-dependent kinase 2
Ligand
BDBM50293161
Substrate
Meas. Tech.
ChEMBL_496926 (CHEMBL1002021)
IC50
450±n/a nM
Citation
 Stevens, KLReno, MJAlberti, JBPrice, DJKane-Carson, LSKnick, VBShewchuk, LMHassell, AMVeal, JMDavis, STGriffin, RJPeel, MR Synthesis and evaluation of pyrazolo[1,5-b]pyridazines as selective cyclin dependent kinase inhibitors. Bioorg Med Chem Lett 18:5758-62 (2009)  
Target
Name:
Cyclin-dependent kinase 2
Synonyms:
CDK2 CDK2_HUMAN Cell division protein kinase 2 Protein cereblon/Cyclin-dependent kinase 2 | p33 protein kinase
Type:
Enzyme Subunit
Mol. Mass.:
33938.17
Organism:
Homo sapiens (Human)
Description:
P24941
Residue:
298
  
Inhibitor
Name:
BDBM50293161
Synonyms:
1-(dimethylamino)-3-(4-(4-(6-morpholinopyrazolo[1,5-b]pyridazin-3-yl)pyrimidin-2-ylamino)phenoxy)propan-2-ol | CHEMBL521871
Type:
Small organic molecule
Emp. Form.:
C25H30N8O3
Mol. Mass.:
490.5575
SMILES:
CN(C)CC(O)COc1ccc(Nc2nccc(n2)-c2cnn3nc(ccc23)N2CCOCC2)cc1
: