Target
Aurora kinase A
Ligand
BDBM50277678
Substrate
Meas. Tech.
ChEMBL_571639 (CHEMBL1031294)
Ki
<1±n/a nM
Citation
 Bebbington, DBinch, HCharrier, JDEveritt, SFraysse, DGolec, JKay, DKnegtel, RMak, CMazzei, FMiller, AMortimore, MO'Donnell, MPatel, SPierard, FPinder, JPollard, JRamaya, SRobinson, DRutherford, AStudley, JWestcott, J The discovery of the potent aurora inhibitor MK-0457 (VX-680). Bioorg Med Chem Lett 19:3586-92 (2009)  
Target
Name:
Aurora kinase A
Synonyms:
AIK ARK-1 AURA AURKA_HUMAN Aurora 2 Aurora kinase A (AURKA) Aurora kinase A (Aurora-2) Aurora/IPL1-related kinase 1 Breast tumor-amplified kinase IAK1 STK15 GN Serine/threonine kinase 15 Serine/threonine-protein kinase 6 Serine/threonine-protein kinase aurora-A aurora-2 | hARK1
Type:
Serine/threonine-protein kinase
Mol. Mass.:
45830.98
Organism:
Homo sapiens (Human)
Description:
O14965
Residue:
403
  
Inhibitor
Name:
BDBM50277678
Synonyms:
CHEMBL485186 | N-(4-(4-(4-cyclopropylpiperazin-1-yl)-6-(5-methyl-1H-pyrazol-3-ylamino)pyrimidin-2-ylthio)phenyl)propionamide
Type:
Small organic molecule
Emp. Form.:
C24H30N8OS
Mol. Mass.:
478.613
SMILES:
CCC(=O)Nc1ccc(Sc2nc(Nc3cc(C)n[nH]3)cc(n2)N2CCN(CC2)C2CC2)cc1
: