Target
Aurora kinase A
Ligand
BDBM50293698
Substrate
Meas. Tech.
ChEMBL_571639 (CHEMBL1031294)
Ki
2.4±n/a nM
Citation
 Bebbington, DBinch, HCharrier, JDEveritt, SFraysse, DGolec, JKay, DKnegtel, RMak, CMazzei, FMiller, AMortimore, MO'Donnell, MPatel, SPierard, FPinder, JPollard, JRamaya, SRobinson, DRutherford, AStudley, JWestcott, J The discovery of the potent aurora inhibitor MK-0457 (VX-680). Bioorg Med Chem Lett 19:3586-92 (2009)  
Target
Name:
Aurora kinase A
Synonyms:
AIK ARK1 AURKA AYK1 Aurora kinase A (AURA) Aurora kinase A (Aurora A) Aurora-related kinase 1 BTAK Breast-tumor-amplified kinase STK15 Serine/threonine kinase 15 Serine/threonine-protein kinase aurora A hARK1
Type:
Serine/threonine-protein kinase
Mol. Mass.:
45830.98
Organism:
Homo sapiens (Human)
Description:
O14965
Residue:
403
  
Inhibitor
Name:
BDBM50293698
Synonyms:
CHEMBL563682 | N-(4-(4-(azetidin-1-yl)-6-(5-methyl-1H-pyrazol-3-ylamino)pyrimidin-2-ylthio)phenyl)propionamide
Type:
Small organic molecule
Emp. Form.:
C20H23N7OS
Mol. Mass.:
409.508
SMILES:
CCC(=O)Nc1ccc(Sc2nc(Nc3cc(C)n[nH]3)cc(n2)N2CCC2)cc1
: