Target
Hexokinase-4
Ligand
BDBM50294464
Substrate
Meas. Tech.
ChEMBL_575546 (CHEMBL1035543)
EC50
250±n/a nM
Citation
 Mitsuya, MKamata, KBamba, MWatanabe, HSasaki, YSasaki, KOhyama, SHosaka, HNagata, YEiki, JNishimura, T Discovery of novel 3,6-disubstituted 2-pyridinecarboxamide derivatives as GK activators. Bioorg Med Chem Lett 19:2718-21 (2009)  
Target
Name:
Hexokinase-4
Synonyms:
GCK Glucokinase (GK) HK IV HXK4_HUMAN Hexokinase-D
Type:
Enzyme
Mol. Mass.:
52175.81
Organism:
Homo sapiens (Human)
Description:
P35557
Residue:
465
  
Inhibitor
Name:
BDBM50294464
Synonyms:
3-(4-fluorophenylthio)-6-(4-methyl-4H-1,2,4-triazol-3-ylthio)-N-(4-methylthiazol-2-yl)picolinamide CHEMBL551043
Type:
Small organic molecule
Emp. Form.:
C19H15FN6OS3
Mol. Mass.:
458.555
SMILES:
Cc1csc(NC(=O)c2nc(Sc3nncn3C)ccc2Sc2ccc(F)cc2)n1
: