Target
Carbonic anhydrase 2
Ligand
BDBM26142
Substrate
Meas. Tech.
ChEMBL_575787 (CHEMBL950887)
Ki
17900±n/a nM
Citation
 Innocenti, AWinum, JYHall, RAMühlschlegel, FAScozzafava, ASupuran, CT Carbonic anhydrase inhibitors. Inhibition of the fungal beta-carbonic anhydrases from Candida albicans and Cryptococcus neoformans with boronic acids. Bioorg Med Chem Lett 19:2642-5 (2009)  
Target
Name:
Carbonic anhydrase 2
Synonyms:
CA-II CAC Carbonate dehydratase II Carbonic anhydrase 2 (CA-II) Carbonic anhydrase C Carbonic anhydrase II (CA-II) Carbonic anhydrase II (hCA II) | Carbonic anhydrase isoenzyme II (hCA II)
Type:
Enzyme
Mol. Mass.:
29250.71
Organism:
Homo sapiens (Human)
Description:
P00918
Residue:
260
  
Inhibitor
Name:
BDBM26142
Synonyms:
(2-phenylethyl)boranediol | Alkylboronic Acid, 21
Type:
Small organic molecule
Emp. Form.:
C8H11BO2
Mol. Mass.:
149.983
SMILES:
OB(O)CCc1ccccc1
: