Target
Carbonic anhydrase
Ligand
BDBM26142
Substrate
Meas. Tech.
ChEMBL_575789 (CHEMBL939895)
Ki
412000±n/a nM
Citation
 Innocenti, AWinum, JYHall, RAMühlschlegel, FAScozzafava, ASupuran, CT Carbonic anhydrase inhibitors. Inhibition of the fungal beta-carbonic anhydrases from Candida albicans and Cryptococcus neoformans with boronic acids. Bioorg Med Chem Lett 19:2642-5 (2009)  
Target
Name:
Carbonic anhydrase
Synonyms:
CAN_CANAL beta-Carbonic Anhydrase
Type:
Enzyme
Mol. Mass.:
31587.59
Organism:
Candida albicans (Yeast)
Description:
Residue:
281
  
Inhibitor
Name:
BDBM26142
Synonyms:
(2-phenylethyl)boranediol | Alkylboronic Acid, 21
Type:
Small organic molecule
Emp. Form.:
C8H11BO2
Mol. Mass.:
149.983
SMILES:
OB(O)CCc1ccccc1
: