Target
Carbonic anhydrase 1
Ligand
BDBM26142
Substrate
Meas. Tech.
ChEMBL_575786 (CHEMBL950886)
Ki
11400±n/a nM
Citation
 Innocenti, AWinum, JYHall, RAMühlschlegel, FAScozzafava, ASupuran, CT Carbonic anhydrase inhibitors. Inhibition of the fungal beta-carbonic anhydrases from Candida albicans and Cryptococcus neoformans with boronic acids. Bioorg Med Chem Lett 19:2642-5 (2009)  
Target
Name:
Carbonic anhydrase 1
Synonyms:
CA-I CAB Carbonate dehydratase I Carbonic anhydrase 1 (CA I) Carbonic anhydrase 1 (Recombinant CA I) Carbonic anhydrase B Carbonic anhydrase I (CA I) Carbonic anhydrase I (CAI) Carbonic anhydrase isoenzyme I (hCA I) | hCA
Type:
Enzyme
Mol. Mass.:
28873.37
Organism:
Homo sapiens (Human)
Description:
P00915
Residue:
261
  
Inhibitor
Name:
BDBM26142
Synonyms:
(2-phenylethyl)boranediol | Alkylboronic Acid, 21
Type:
Small organic molecule
Emp. Form.:
C8H11BO2
Mol. Mass.:
149.983
SMILES:
OB(O)CCc1ccccc1
: