Target
D(2) dopamine receptor
Ligand
BDBM50251028
Substrate
Meas. Tech.
ChEMBL_578484 (CHEMBL1063143)
EC50
43±n/a nM
Citation
 Herm, LBerényi, SVonk, ARinken, ASipos, A N-Substituted-2-alkyl- and 2-arylnorapomorphines: novel, highly active D2 agonists. Bioorg Med Chem 17:4756-62 (2009)  
Target
Name:
D(2) dopamine receptor
Synonyms:
DOPAMINE D2 DOPAMINE D2 Short Dopamine D2 receptor Drd2
Type:
G Protein-Coupled Receptor (GPCR)
Mol. Mass.:
50931.60
Organism:
Rattus norvegicus (rat)
Description:
P61169
Residue:
444
  
Inhibitor
Name:
BDBM50251028
Synonyms:
(R)-(-)-2-Methyl-apomorphine hydrochloride CHEMBL557547
Type:
Small organic molecule
Emp. Form.:
C18H19NO2
Mol. Mass.:
281.349
SMILES:
CN1CCc2cc(C)cc-3c2[C@H]1Cc1ccc(O)c(O)c-31
: