Target
Stearoyl-CoA desaturase
Ligand
BDBM50296294
Substrate
Meas. Tech.
ChEMBL_577394 (CHEMBL1056246)
IC50
3±n/a nM
Citation
 Uto, YOgata, TKiyotsuka, YMiyazawa, YUeno, YKurata, HDeguchi, TYamada, MWatanabe, NTakagi, TWakimoto, SOkuyama, RKonishi, MKurikawa, NKono, KOsumi, J Novel and potent inhibitors of stearoyl-CoA desaturase-1. Part II: Identification of 4-ethylamino-3-(2-hydroxyethoxy)-N-[5-(3-trifluoromethylbenzyl)thiazol-2-yl]benzamide and its biological evaluation. Bioorg Med Chem Lett 19:4159-66 (2009)  
Target
Name:
Stearoyl-CoA desaturase
Synonyms:
Acyl-CoA desaturase SCD SCDOS Stearoyl-CoA (SCD1) | Stearoyl-CoA desaturase 1
Type:
Enzyme
Mol. Mass.:
41537.27
Organism:
Homo sapiens (Human)
Description:
O00767
Residue:
359
  
Inhibitor
Name:
BDBM50296294
Synonyms:
3-(2-hydroxyethoxy)-4-methoxy-N-(5-(3-(trifluoromethyl)benzyl)thiazol-2-yl)benzamide CHEMBL550172
Type:
Small organic molecule
Emp. Form.:
C21H19F3N2O4S
Mol. Mass.:
452.447
SMILES:
COc1ccc(cc1OCCO)C(=O)Nc1ncc(Cc2cccc(c2)C(F)(F)F)s1
: