Target
Amine oxidase [flavin-containing] B
Ligand
BDBM50116067
Substrate
Meas. Tech.
ChEMBL_585481 (CHEMBL1059215)
IC50
17000±n/a nM
Citation
 Boppana, KDubey, PKJagarlapudi, SAVadivelan, SRambabu, G Knowledge based identification of MAO-B selective inhibitors using pharmacophore and structure based virtual screening models. Eur J Med Chem 44:3584-90 (2009)  
Target
Name:
Amine oxidase [flavin-containing] B
Synonyms:
AOFB_HUMAN MAOB Monoamine oxidase type B (MAO B) Monoamine oxidase type B (MAOB)
Type:
Protein
Mol. Mass.:
58768.76
Organism:
Homo sapiens (Human)
Description:
P27338
Residue:
520
  
Inhibitor
Name:
BDBM50116067
Synonyms:
(Linezolid)N-[3-(3-Fluoro-4-morpholin-4-yl-phenyl)-2-oxo-oxazolidin-5-ylmethyl]-acetamide (S)-3-(3-Fluoro-4-morpholin-4-yl-phenyl)-5-[(1-hydroxy-ethylamino)-methyl]-oxazolidin-2-one (S)-N-((3-fluoro-4-morpholinophenyl)-2-oxaoxazolidin-5-yl)methyl)acetamide CHEMBL126 Linezoid N-[(R)-3-(3-Fluoro-4-morpholin-4-yl-phenyl)-2-oxo-oxazolidin-5-ylmethyl]-acetamide N-[3-(3-Fluoro-4-morpholin-4-yl-phenyl)-2-oxo-oxazolidin-5-ylmethyl]-acetamide N-{[(5S)-3-(3-fluoro-4-morpholin-4-ylphenyl)-2-oxo-1,3-oxazolidin-5-yl]methyl}acetamide Zyvox | cid_441401
Type:
Small organic molecule
Emp. Form.:
C16H20FN3O4
Mol. Mass.:
337.3461
SMILES:
CC(=O)NC[C@H]1CN(C(=O)O1)c1ccc(N2CCOCC2)c(F)c1
: