Target
C-X-C chemokine receptor type 1
Ligand
BDBM50297738
Substrate
Meas. Tech.
ChEMBL_584048 (CHEMBL1055928)
Ki
30±n/a nM
Citation
 Aki, CChao, JFerreira, JADwyer, MPYu, YChao, JMerritt, RJLai, GWu, MHipkin, RWFan, XGonsiorek, WFosseta, JRindgen, DFine, JLundell, DTaveras, AGBiju, P Diaminocyclobutenediones as potent and orally bioavailable CXCR2 receptor antagonists: SAR in the phenolic amide region. Bioorg Med Chem Lett 19:4446-9 (2009)  
Target
Name:
C-X-C chemokine receptor type 1
Synonyms:
C-X-C chemokine receptor type 1 (CXCR-1) CMKAR1 CXCR1_HUMAN Interleukin-8 receptor A | Interleukin-8 receptors, CXCR1/CXCR2
Type:
Enzyme
Mol. Mass.:
39803.83
Organism:
Homo sapiens (Human)
Description:
P25024
Residue:
350
  
Inhibitor
Name:
BDBM50297738
Synonyms:
(R)-1-(3-(3,4-dioxo-2-(1-phenylpropylamino)cyclobut-1-enylamino)-2-hydroxybenzoyl)pyrrolidine-2-carboxylic acid | CHEMBL556862
Type:
Small organic molecule
Emp. Form.:
C25H25N3O6
Mol. Mass.:
463.4825
SMILES:
CC[C@@H](Nc1c(Nc2cccc(C(=O)N3CCCC3C(O)=O)c2O)c(=O)c1=O)c1ccccc1
: