Target
Hexokinase-4
Ligand
BDBM50300593
Substrate
Meas. Tech.
ChEMBL_588968 (CHEMBL1056163)
EC50
10±n/a nM
Citation
 Iino, TSasaki, YBamba, MMitsuya, MOhno, AKamata, KHosaka, HMaruki, HFutamura, MYoshimoto, ROhyama, SSasaki, KChiba, MOhtake, NNagata, YEiki, JNishimura, T Discovery and structure-activity relationships of a novel class of quinazoline glucokinase activators. Bioorg Med Chem Lett 19:5531-8 (2009)  
Target
Name:
Hexokinase-4
Synonyms:
GCK Glucokinase (GK) HK IV HXK4_HUMAN Hexokinase-D
Type:
Enzyme
Mol. Mass.:
52175.81
Organism:
Homo sapiens (Human)
Description:
P35557
Residue:
465
  
Inhibitor
Name:
BDBM50300593
Synonyms:
3-methyl-2-(4-(1-methyl-1H-pyrazol-3-ylamino)quinazolin-6-yloxy)benzonitrile | CHEMBL572840
Type:
Small organic molecule
Emp. Form.:
C20H16N6O
Mol. Mass.:
356.3806
SMILES:
Cc1cccc(C#N)c1Oc1ccc2ncnc(Nc3ccn(C)n3)c2c1
: