Target
Beta-1 adrenergic receptor
Ligand
BDBM50151720
Substrate
Meas. Tech.
ChEMBL_599079 (CHEMBL1044605)
EC50
86±n/a nM
Citation
 Bouyssou, TRudolf, KHoenke, CLustenberger, PSchnapp, AKonetzki, I Studies towards topical selective beta2-adrenoceptor agonists with a long duration of action. Bioorg Med Chem Lett 19:5237-40 (2009)  
Target
Name:
Beta-1 adrenergic receptor
Synonyms:
ADRB1 ADRB1_HUMAN Beta-1 adrenoceptor adrenergic Beta1
Type:
G Protein-Coupled Receptor (GPCR)
Mol. Mass.:
51338.40
Organism:
Homo sapiens (Human)
Description:
P08588
Residue:
477
  
Inhibitor
Name:
BDBM50151720
Synonyms:
ARFORMOTEROL TARTRATE CHEMBL605993 FORMOTEROL FUMARATE N-(2-Hydroxy-5-{1-hydroxy-2-[2-(4-methoxy-phenyl)-1-methyl-ethylamino]-ethyl}-phenyl)-formamide Symbicort | cid_9912089
Type:
Small organic molecule
Emp. Form.:
C19H24N2O4
Mol. Mass.:
344.4049
SMILES:
COc1ccc(C[C@@H](C)NC[C@H](O)c2ccc(O)c(NC=O)c2)cc1
: