Target
Histamine H1 receptor
Ligand
BDBM50301391
Substrate
Meas. Tech.
ChEMBL_599955 (CHEMBL1048093)
Ki
39±n/a nM
Citation
 Aslanian, RPiwinski, JJZhu, XPriestley, TSorota, SDu, XYZhang, XSMcLeod, RLWest, REWilliams, SMHey, JA Structural determinants for histamine H(1) affinity, hERG affinity and QTc prolongation in a series of terfenadine analogs. Bioorg Med Chem Lett 19:5043-7 (2009)  
Target
Name:
Histamine H1 receptor
Synonyms:
H1R HISTAMINE H1 HRH1_HUMAN
Type:
G Protein-Coupled Receptor (GPCR)
Mol. Mass.:
55808.72
Organism:
Homo sapiens (Human)
Description:
Cell pellets from SK-N-MC cells transfected with human H1 receptor were used in binding assay.
Residue:
487
  
Inhibitor
Name:
BDBM50301391
Synonyms:
1-[4-(4-methylphenyl)butyl]-alpha,alpha-diphenyl-4-piperdine-methanol | CHEMBL571389
Type:
Small organic molecule
Emp. Form.:
C29H35NO
Mol. Mass.:
413.5943
SMILES:
Cc1ccc(CCCCN2CCC(CC2)C(O)(c2ccccc2)c2ccccc2)cc1
: