Target
Histamine H1 receptor
Ligand
BDBM50301399
Substrate
Meas. Tech.
ChEMBL_599955 (CHEMBL1048093)
Ki
155±n/a nM
Citation
 Aslanian, RPiwinski, JJZhu, XPriestley, TSorota, SDu, XYZhang, XSMcLeod, RLWest, REWilliams, SMHey, JA Structural determinants for histamine H(1) affinity, hERG affinity and QTc prolongation in a series of terfenadine analogs. Bioorg Med Chem Lett 19:5043-7 (2009)  
Target
Name:
Histamine H1 receptor
Synonyms:
H1R HISTAMINE H1 HRH1_HUMAN
Type:
G Protein-Coupled Receptor (GPCR)
Mol. Mass.:
55808.72
Organism:
Homo sapiens (Human)
Description:
Cell pellets from SK-N-MC cells transfected with human H1 receptor were used in binding assay.
Residue:
487
  
Inhibitor
Name:
BDBM50301399
Synonyms:
CHEMBL570695 | Diphenyl-[1-(3-p-tolyl-propyl)-piperidin-4-yl]-methanol
Type:
Small organic molecule
Emp. Form.:
C28H33NO
Mol. Mass.:
399.5677
SMILES:
Cc1ccc(CCCN2CCC(CC2)C(O)(c2ccccc2)c2ccccc2)cc1
: