Target
Potassium voltage-gated channel subfamily H member 2
Ligand
BDBM50017724
Substrate
Meas. Tech.
ChEMBL_599954 (CHEMBL1048092)
IC50
>100000±n/a nM
Citation
 Aslanian, RPiwinski, JJZhu, XPriestley, TSorota, SDu, XYZhang, XSMcLeod, RLWest, REWilliams, SMHey, JA Structural determinants for histamine H(1) affinity, hERG affinity and QTc prolongation in a series of terfenadine analogs. Bioorg Med Chem Lett 19:5043-7 (2009)  
Target
Name:
Potassium voltage-gated channel subfamily H member 2
Synonyms:
1,3-beta-glucan synthase component GLS2 ERG Eag-related protein 1 Ether-a-go-go-related gene (HERG) Ether-a-go-go-related gene potassium channel 1 Ether-a-go-go-related gene potassium channel 1 (hERG1) Ether-a-go-go-related protein 1 H-ERG KCNH2 Potassium voltage-gated channel subfamily H member 2 (hERG) Voltage-gated potassium channel subunit Kv11.1 hERG Potassium Channel 1 | putative potassium channel subunit
Type:
Multi-pass membrane protein
Mol. Mass.:
126672.65
Organism:
Homo sapiens (Human)
Description:
Q12809
Residue:
1159
  
Inhibitor
Name:
BDBM50017724
Synonyms:
CHEMBL127508 diphenyl(piperidin-4-yl)methanol
Type:
Small organic molecule
Emp. Form.:
C18H21NO
Mol. Mass.:
267.3654
SMILES:
OC(C1CCNCC1)(c1ccccc1)c1ccccc1
: