Target
Potassium voltage-gated channel subfamily H member 2
Ligand
BDBM50301391
Substrate
Meas. Tech.
ChEMBL_599953 (CHEMBL1048091)
IC50
396±n/a nM
Citation
 Aslanian, RPiwinski, JJZhu, XPriestley, TSorota, SDu, XYZhang, XSMcLeod, RLWest, REWilliams, SMHey, JA Structural determinants for histamine H(1) affinity, hERG affinity and QTc prolongation in a series of terfenadine analogs. Bioorg Med Chem Lett 19:5043-7 (2009)  
Target
Name:
Potassium voltage-gated channel subfamily H member 2
Synonyms:
1,3-beta-glucan synthase component GLS2 ERG Eag-related protein 1 Ether-a-go-go-related gene (HERG) Ether-a-go-go-related gene potassium channel 1 Ether-a-go-go-related gene potassium channel 1 (hERG1) Ether-a-go-go-related protein 1 H-ERG KCNH2 Potassium voltage-gated channel subfamily H member 2 (hERG) Voltage-gated potassium channel subunit Kv11.1 hERG Potassium Channel 1 | putative potassium channel subunit
Type:
Multi-pass membrane protein
Mol. Mass.:
126672.65
Organism:
Homo sapiens (Human)
Description:
Q12809
Residue:
1159
  
Inhibitor
Name:
BDBM50301391
Synonyms:
1-[4-(4-methylphenyl)butyl]-alpha,alpha-diphenyl-4-piperdine-methanol | CHEMBL571389
Type:
Small organic molecule
Emp. Form.:
C29H35NO
Mol. Mass.:
413.5943
SMILES:
Cc1ccc(CCCCN2CCC(CC2)C(O)(c2ccccc2)c2ccccc2)cc1
: