Target
DNA-(apurinic or apyrimidinic site) endonuclease
Ligand
BDBM50303965
Substrate
Meas. Tech.
ChEMBL_595225 (CHEMBL1043577)
IC50
1000±n/a nM
Citation
 Nyland, RLLuo, MKelley, MRBorch, RF Design and synthesis of novel quinone inhibitors targeted to the redox function of apurinic/apyrimidinic endonuclease 1/redox enhancing factor-1 (Ape1/ref-1). J Med Chem 53:1200-10 (2010)  
Target
Name:
DNA-(apurinic or apyrimidinic site) endonuclease
Synonyms:
APE APEX APEX1_HUMAN Apurinic-apyrimidinic endonuclease 1 (APE-1) DNA-(apurinic or apyrimidinic site) lyase REF1
Type:
Protein
Mol. Mass.:
35560.12
Organism:
Homo sapiens (Human)
Description:
P27695
Residue:
318
  
Inhibitor
Name:
BDBM50303965
Synonyms:
(E)-3-(3-Methylthio-1,4-naphthoquinon-2-yl)-2-methylpropenoic Acid | CHEMBL572060
Type:
Small organic molecule
Emp. Form.:
C15H12O4S
Mol. Mass.:
288.318
SMILES:
CSC1=C(\C=C(/C)C(O)=O)C(=O)c2ccccc2C1=O
: