Target
Sodium-dependent serotonin transporter
Ligand
BDBM50304075
Substrate
Meas. Tech.
ChEMBL_601721 (CHEMBL1050456)
IC50
>10000±n/a nM
Citation
 Peng, YZhang, QArora, SKeenan, SMKortagere, SWannemacher, KMHowells, RDWelsh, WJ Novel delta opioid receptor agonists exhibit differential stimulation of signaling pathways. Bioorg Med Chem 17:6442-50 (2009)  
Target
Name:
Sodium-dependent serotonin transporter
Synonyms:
5-HT Transporter 5HTT SC6A4_HUMAN SLC6A4 Serotonin transporter (5HTT) Sodium-dependent serotonin transporter (SERT) | Solute carrier family 6 member 4
Type:
Multi-pass membrane protein
Mol. Mass.:
70322.51
Organism:
Homo sapiens (Human)
Description:
P31645
Residue:
630
  
Inhibitor
Name:
BDBM50304075
Synonyms:
3-(5-(4-tert-butylphenyl)-3-((dimethylamino)methyl)-1H-1,2,4-triazol-1-yl)phenol | CHEMBL595449
Type:
Small organic molecule
Emp. Form.:
C21H26N4O
Mol. Mass.:
350.4573
SMILES:
CN(C)Cc1nc(-c2ccc(cc2)C(C)(C)C)n(n1)-c1cccc(O)c1
: