Target
Nitric oxide synthase, brain
Ligand
BDBM50209237
Substrate
Meas. Tech.
ChEMBL_600962 (CHEMBL1046067)
IC50
4300±n/a nM
Citation
 Claramunt, RMLópez, CPérez-Medina, CPérez-Torralba, MElguero, JEscames, GAcuña-Castroviejo, D Fluorinated indazoles as novel selective inhibitors of nitric oxide synthase (NOS): synthesis and biological evaluation. Bioorg Med Chem 17:6180-7 (2009)  
Target
Name:
Nitric oxide synthase, brain
Synonyms:
Constitutive NOS NC-NOS NOS type I nNOS NOS1_HUMAN Neuronal nitric oxide synthase Nitric oxide synthase, neuronal (nNOS) bNOS | nNOS
Type:
Homodimer
Mol. Mass.:
160985.98
Organism:
Homo sapiens (Human)
Description:
P29475
Residue:
1434
  
Inhibitor
Name:
BDBM50209237
Synonyms:
6-bromo-1H-indazole | CHEMBL247365
Type:
Small organic molecule
Emp. Form.:
C7H5BrN2
Mol. Mass.:
197.032
SMILES:
Brc1ccc2cn[nH]c2c1
: