Target
Nitric oxide synthase, inducible
Ligand
BDBM50209245
Substrate
Meas. Tech.
ChEMBL_600963 (CHEMBL1046068)
IC50
5800±n/a nM
Citation
 Claramunt, RMLópez, CPérez-Medina, CPérez-Torralba, MElguero, JEscames, GAcuña-Castroviejo, D Fluorinated indazoles as novel selective inhibitors of nitric oxide synthase (NOS): synthesis and biological evaluation. Bioorg Med Chem 17:6180-7 (2009)  
Target
Name:
Nitric oxide synthase, inducible
Synonyms:
HEP-NOS Inducible NO synthase NOS type II NOS2A Nitric oxide synthase, inducible (iNOS) | iNOS
Type:
Homodimer
Mol. Mass.:
131141.95
Organism:
Homo sapiens (Human)
Description:
P35228
Residue:
1153
  
Inhibitor
Name:
BDBM50209245
Synonyms:
CHEMBL247378
Type:
Small organic molecule
Emp. Form.:
C7H5N3O2
Mol. Mass.:
163.1335
SMILES:
[O-][N+](=O)c1cccc2cn[nH]c12
: