Target
5-hydroxytryptamine receptor 1A
Ligand
BDBM50305091
Substrate
Meas. Tech.
ChEMBL_603081 (CHEMBL1048564)
Ki
4±n/a nM
Citation
 Shen, ZSiva Ramamoorthy, PHatzenbuhler, NTEvrard, DAChilders, WHarrison, BLChlenov, MHornby, GSmith, DLSullivan, KMSchechter, LEAndree, TH Synthesis and structure-activity relationship of novel lactam-fused chroman derivatives having dual affinity at the 5-HT(1A) receptor and the serotonin transporter. Bioorg Med Chem Lett 20:222-7 (2010)  
Target
Name:
5-hydroxytryptamine receptor 1A
Synonyms:
5-HT-1A 5-hydroxytryptamine receptor 1A (5-HT-1A) ADRB2RL1 Dopamine D2 receptor and serotonin 1a receptor HTR1A | Serotonin receptor 1A
Type:
Mol. Mass.:
46122.49
Organism:
Homo sapiens (Human)
Description:
Residue:
422
  
Inhibitor
Name:
BDBM50305091
Synonyms:
(+/-)-9-(ethyl(3-(5-fluoro-1H-indol-3-yl)propyl)amino)-6-fluoro-2,3,4,8,9,10-hexahydro-1H-pyrano[2,3-h]isoquinolin-1-one | CHEMBL595055
Type:
Small organic molecule
Emp. Form.:
C25H27F2N3O2
Mol. Mass.:
439.4976
SMILES:
CCN(CCCc1c[nH]c2ccc(F)cc12)C1COc2c(F)cc3CCNC(=O)c3c2C1
: