Target
5-hydroxytryptamine receptor 1A
Ligand
BDBM50305105
Substrate
Meas. Tech.
ChEMBL_603081 (CHEMBL1048564)
Ki
2±n/a nM
Citation
 Shen, ZSiva Ramamoorthy, PHatzenbuhler, NTEvrard, DAChilders, WHarrison, BLChlenov, MHornby, GSmith, DLSullivan, KMSchechter, LEAndree, TH Synthesis and structure-activity relationship of novel lactam-fused chroman derivatives having dual affinity at the 5-HT(1A) receptor and the serotonin transporter. Bioorg Med Chem Lett 20:222-7 (2010)  
Target
Name:
5-hydroxytryptamine receptor 1A
Synonyms:
5-HT-1A 5-hydroxytryptamine receptor 1A (5-HT-1A) ADRB2RL1 Dopamine D2 receptor and serotonin 1a receptor HTR1A | Serotonin receptor 1A
Type:
Mol. Mass.:
46122.49
Organism:
Homo sapiens (Human)
Description:
Residue:
422
  
Inhibitor
Name:
BDBM50305105
Synonyms:
(+/-)-8-(ethyl(3-(5-fluoro-1H-indol-3-yl)propyl)amino)-2,3,8,9-tetrahydropyrano[3,2-e]isoindol-1(7H)-one | CHEMBL592029
Type:
Small organic molecule
Emp. Form.:
C24H26FN3O2
Mol. Mass.:
407.4805
SMILES:
CCN(CCCc1c[nH]c2ccc(F)cc12)C1COc2ccc3CNC(=O)c3c2C1
: