Target
5-hydroxytryptamine receptor 1A
Ligand
BDBM50305109
Substrate
Meas. Tech.
ChEMBL_603081 (CHEMBL1048564)
Ki
36±n/a nM
Citation
 Shen, ZSiva Ramamoorthy, PHatzenbuhler, NTEvrard, DAChilders, WHarrison, BLChlenov, MHornby, GSmith, DLSullivan, KMSchechter, LEAndree, TH Synthesis and structure-activity relationship of novel lactam-fused chroman derivatives having dual affinity at the 5-HT(1A) receptor and the serotonin transporter. Bioorg Med Chem Lett 20:222-7 (2010)  
Target
Name:
5-hydroxytryptamine receptor 1A
Synonyms:
5-HT-1A 5-hydroxytryptamine receptor 1A (5-HT-1A) ADRB2RL1 Dopamine D2 receptor and serotonin 1a receptor HTR1A | Serotonin receptor 1A
Type:
Mol. Mass.:
46122.49
Organism:
Homo sapiens (Human)
Description:
Residue:
422
  
Inhibitor
Name:
BDBM50305109
Synonyms:
(+/-)-3-(3-(1-oxo-1,2,3,7,8,9-hexahydropyrano[3,2-e]isoindol-8-ylamino)propyl)-1H-indole-5-carbonitrile | CHEMBL606864
Type:
Small organic molecule
Emp. Form.:
C23H22N4O2
Mol. Mass.:
386.4464
SMILES:
O=C1NCc2ccc3OCC(Cc3c12)NCCCc1c[nH]c2ccc(cc12)C#N
: