Target
5-hydroxytryptamine receptor 1A
Ligand
BDBM50305110
Substrate
Meas. Tech.
ChEMBL_603081 (CHEMBL1048564)
Ki
4.00±n/a nM
Citation
 Shen, ZSiva Ramamoorthy, PHatzenbuhler, NTEvrard, DAChilders, WHarrison, BLChlenov, MHornby, GSmith, DLSullivan, KMSchechter, LEAndree, TH Synthesis and structure-activity relationship of novel lactam-fused chroman derivatives having dual affinity at the 5-HT(1A) receptor and the serotonin transporter. Bioorg Med Chem Lett 20:222-7 (2010)  
Target
Name:
5-hydroxytryptamine receptor 1A
Synonyms:
5-HT-1A 5-hydroxytryptamine receptor 1A (5-HT-1A) ADRB2RL1 Dopamine D2 receptor and serotonin 1a receptor HTR1A | Serotonin receptor 1A
Type:
Mol. Mass.:
46122.49
Organism:
Homo sapiens (Human)
Description:
Residue:
422
  
Inhibitor
Name:
BDBM50305110
Synonyms:
(+)-3-(4-((cyclopropylmethyl)(1-oxo-1,2,3,7,8,9-hexahydropyrano[3,2-e]isoindol-8-yl)amino)butyl)-1H-indole-5-carbonitrile (-)-3-(4-((cyclopropylmethyl)(1-oxo-1,2,3,7,8,9-hexahydropyrano[3,2-e]isoindol-8-yl)amino)butyl)-1H-indole-5-carbonitrile | CHEMBL596297
Type:
Small organic molecule
Emp. Form.:
C28H30N4O2
Mol. Mass.:
454.5634
SMILES:
O=C1NCc2ccc3OCC(Cc3c12)N(CCCCc1c[nH]c2ccc(cc12)C#N)CC1CC1
: