Target
Sodium-dependent serotonin transporter
Ligand
BDBM50305091
Substrate
Meas. Tech.
ChEMBL_603082 (CHEMBL1048565)
Ki
15±n/a nM
Citation
 Shen, ZSiva Ramamoorthy, PHatzenbuhler, NTEvrard, DAChilders, WHarrison, BLChlenov, MHornby, GSmith, DLSullivan, KMSchechter, LEAndree, TH Synthesis and structure-activity relationship of novel lactam-fused chroman derivatives having dual affinity at the 5-HT(1A) receptor and the serotonin transporter. Bioorg Med Chem Lett 20:222-7 (2010)  
Target
Name:
Sodium-dependent serotonin transporter
Synonyms:
5-HT Transporter 5HTT SC6A4_HUMAN SLC6A4 Serotonin transporter (5HTT) Sodium-dependent serotonin transporter (SERT) | Solute carrier family 6 member 4
Type:
Multi-pass membrane protein
Mol. Mass.:
70322.51
Organism:
Homo sapiens (Human)
Description:
P31645
Residue:
630
  
Inhibitor
Name:
BDBM50305091
Synonyms:
(+/-)-9-(ethyl(3-(5-fluoro-1H-indol-3-yl)propyl)amino)-6-fluoro-2,3,4,8,9,10-hexahydro-1H-pyrano[2,3-h]isoquinolin-1-one | CHEMBL595055
Type:
Small organic molecule
Emp. Form.:
C25H27F2N3O2
Mol. Mass.:
439.4976
SMILES:
CCN(CCCc1c[nH]c2ccc(F)cc12)C1COc2c(F)cc3CCNC(=O)c3c2C1
: