Target
Sodium-dependent serotonin transporter
Ligand
BDBM50305092
Substrate
Meas. Tech.
ChEMBL_603082 (CHEMBL1048565)
Ki
112±n/a nM
Citation
 Shen, ZSiva Ramamoorthy, PHatzenbuhler, NTEvrard, DAChilders, WHarrison, BLChlenov, MHornby, GSmith, DLSullivan, KMSchechter, LEAndree, TH Synthesis and structure-activity relationship of novel lactam-fused chroman derivatives having dual affinity at the 5-HT(1A) receptor and the serotonin transporter. Bioorg Med Chem Lett 20:222-7 (2010)  
Target
Name:
Sodium-dependent serotonin transporter
Synonyms:
5-HT Transporter 5HTT SC6A4_HUMAN SLC6A4 Serotonin transporter (5HTT) Sodium-dependent serotonin transporter (SERT) | Solute carrier family 6 member 4
Type:
Multi-pass membrane protein
Mol. Mass.:
70322.51
Organism:
Homo sapiens (Human)
Description:
P31645
Residue:
630
  
Inhibitor
Name:
BDBM50305092
Synonyms:
(+/-)-9-((cyclopropylmethyl)(3-(5-fluoro-1H-indol-3-yl)propyl)amino)-6-fluoro-2,3,4,8,9,10-hexahydro-1H-pyrano[2,3-h]isoquinolin-1-one | CHEMBL592939
Type:
Small organic molecule
Emp. Form.:
C27H29F2N3O2
Mol. Mass.:
465.5349
SMILES:
Fc1ccc2[nH]cc(CCCN(CC3CC3)C3COc4c(F)cc5CCNC(=O)c5c4C3)c2c1
: