Target
Sodium-dependent serotonin transporter
Ligand
BDBM50305110
Substrate
Meas. Tech.
ChEMBL_603082 (CHEMBL1048565)
Ki
25.0±n/a nM
Citation
 Shen, ZSiva Ramamoorthy, PHatzenbuhler, NTEvrard, DAChilders, WHarrison, BLChlenov, MHornby, GSmith, DLSullivan, KMSchechter, LEAndree, TH Synthesis and structure-activity relationship of novel lactam-fused chroman derivatives having dual affinity at the 5-HT(1A) receptor and the serotonin transporter. Bioorg Med Chem Lett 20:222-7 (2010)  
Target
Name:
Sodium-dependent serotonin transporter
Synonyms:
5-HT Transporter 5HTT SC6A4_HUMAN SLC6A4 Serotonin transporter (5HTT) Sodium-dependent serotonin transporter (SERT) | Solute carrier family 6 member 4
Type:
Multi-pass membrane protein
Mol. Mass.:
70322.51
Organism:
Homo sapiens (Human)
Description:
P31645
Residue:
630
  
Inhibitor
Name:
BDBM50305110
Synonyms:
(+)-3-(4-((cyclopropylmethyl)(1-oxo-1,2,3,7,8,9-hexahydropyrano[3,2-e]isoindol-8-yl)amino)butyl)-1H-indole-5-carbonitrile (-)-3-(4-((cyclopropylmethyl)(1-oxo-1,2,3,7,8,9-hexahydropyrano[3,2-e]isoindol-8-yl)amino)butyl)-1H-indole-5-carbonitrile | CHEMBL596297
Type:
Small organic molecule
Emp. Form.:
C28H30N4O2
Mol. Mass.:
454.5634
SMILES:
O=C1NCc2ccc3OCC(Cc3c12)N(CCCCc1c[nH]c2ccc(cc12)C#N)CC1CC1
: