Target
Sodium-dependent serotonin transporter
Ligand
BDBM50305111
Substrate
Meas. Tech.
ChEMBL_603082 (CHEMBL1048565)
Ki
20±n/a nM
Citation
 Shen, ZSiva Ramamoorthy, PHatzenbuhler, NTEvrard, DAChilders, WHarrison, BLChlenov, MHornby, GSmith, DLSullivan, KMSchechter, LEAndree, TH Synthesis and structure-activity relationship of novel lactam-fused chroman derivatives having dual affinity at the 5-HT(1A) receptor and the serotonin transporter. Bioorg Med Chem Lett 20:222-7 (2010)  
Target
Name:
Sodium-dependent serotonin transporter
Synonyms:
5-HT Transporter 5HTT SC6A4_HUMAN SLC6A4 Serotonin transporter (5HTT) Sodium-dependent serotonin transporter (SERT) | Solute carrier family 6 member 4
Type:
Multi-pass membrane protein
Mol. Mass.:
70322.51
Organism:
Homo sapiens (Human)
Description:
P31645
Residue:
630
  
Inhibitor
Name:
BDBM50305111
Synonyms:
(+/-)-8-(4-(5-fluoro-1H-indol-3-yl)butylamino)-2,3,8,9-tetrahydropyrano[3,2-e]isoindol-1(7H)-one | CHEMBL595622
Type:
Small organic molecule
Emp. Form.:
C23H24FN3O2
Mol. Mass.:
393.454
SMILES:
Fc1ccc2[nH]cc(CCCCNC3COc4ccc5CNC(=O)c5c4C3)c2c1
: