Target
Fructose-1,6-bisphosphatase 1
Ligand
BDBM50305560
Substrate
Meas. Tech.
ChEMBL_604516 (CHEMBL1074686)
EC50
87000±n/a nM
Citation
 Kitas, EMohr, PKuhn, BHebeisen, PWessel, HPHaap, WRuf, ABenz, JJoseph, CHuber, WSanchez, RAPaehler, ABenardeau, AGubler, MSchott, BTozzo, E Sulfonylureido thiazoles as fructose-1,6-bisphosphatase inhibitors for the treatment of type-2 diabetes. Bioorg Med Chem Lett 20:594-9 (2010)  
Target
Name:
Fructose-1,6-bisphosphatase 1
Synonyms:
F16P1_MOUSE Fbp1 | Fbp3
Type:
PROTEIN
Mol. Mass.:
36912.07
Organism:
Mus musculus
Description:
ChEMBL_748173
Residue:
338
  
Inhibitor
Name:
BDBM50305560
Synonyms:
4-bromo-N-(5-bromothiazol-2-ylcarbamoyl)-5-chlorothiophene-2-sulfonamide | CHEMBL610462
Type:
Small organic molecule
Emp. Form.:
C8H4Br2ClN3O3S3
Mol. Mass.:
481.592
SMILES:
Clc1sc(cc1Br)S(=O)(=O)NC(=O)Nc1ncc(Br)s1
: