Target
Fructose-1,6-bisphosphatase 1
Ligand
BDBM50305566
Substrate
Meas. Tech.
ChEMBL_604516 (CHEMBL1074686)
EC50
27000±n/a nM
Citation
 Kitas, EMohr, PKuhn, BHebeisen, PWessel, HPHaap, WRuf, ABenz, JJoseph, CHuber, WSanchez, RAPaehler, ABenardeau, AGubler, MSchott, BTozzo, E Sulfonylureido thiazoles as fructose-1,6-bisphosphatase inhibitors for the treatment of type-2 diabetes. Bioorg Med Chem Lett 20:594-9 (2010)  
Target
Name:
Fructose-1,6-bisphosphatase 1
Synonyms:
F16P1_MOUSE Fbp1 | Fbp3
Type:
PROTEIN
Mol. Mass.:
36912.07
Organism:
Mus musculus
Description:
ChEMBL_748173
Residue:
338
  
Inhibitor
Name:
BDBM50305566
Synonyms:
CHEMBL585961 | N-(5-bromothiazol-2-ylcarbamoyl)-6,7-dihydro-4H-thieno[3,2-c]pyran-2-sulfonamide
Type:
Small organic molecule
Emp. Form.:
C11H10BrN3O4S3
Mol. Mass.:
424.314
SMILES:
Brc1cnc(NC(=O)NS(=O)(=O)c2cc3COCCc3s2)s1
: