Target
Fructose-1,6-bisphosphatase 1
Ligand
BDBM50305580
Substrate
Meas. Tech.
ChEMBL_604516 (CHEMBL1074686)
EC50
2800±n/a nM
Citation
 Kitas, EMohr, PKuhn, BHebeisen, PWessel, HPHaap, WRuf, ABenz, JJoseph, CHuber, WSanchez, RAPaehler, ABenardeau, AGubler, MSchott, BTozzo, E Sulfonylureido thiazoles as fructose-1,6-bisphosphatase inhibitors for the treatment of type-2 diabetes. Bioorg Med Chem Lett 20:594-9 (2010)  
Target
Name:
Fructose-1,6-bisphosphatase 1
Synonyms:
F16P1_MOUSE Fbp1 | Fbp3
Type:
PROTEIN
Mol. Mass.:
36912.07
Organism:
Mus musculus
Description:
ChEMBL_748173
Residue:
338
  
Inhibitor
Name:
BDBM50305580
Synonyms:
5-(2-hydroxyethyl)-4-methyl-N-(4-methyl-5-(methylthio)thiazol-2-ylcarbamoyl)thiophene-2-sulfonamide | CHEMBL605615
Type:
Small organic molecule
Emp. Form.:
C13H17N3O4S4
Mol. Mass.:
407.552
SMILES:
CSc1sc(NC(=O)NS(=O)(=O)c2cc(C)c(CCO)s2)nc1C
: