Target
Fructose-1,6-bisphosphatase 1
Ligand
BDBM50305586
Substrate
Meas. Tech.
ChEMBL_604516 (CHEMBL1074686)
EC50
19000±n/a nM
Citation
 Kitas, EMohr, PKuhn, BHebeisen, PWessel, HPHaap, WRuf, ABenz, JJoseph, CHuber, WSanchez, RAPaehler, ABenardeau, AGubler, MSchott, BTozzo, E Sulfonylureido thiazoles as fructose-1,6-bisphosphatase inhibitors for the treatment of type-2 diabetes. Bioorg Med Chem Lett 20:594-9 (2010)  
Target
Name:
Fructose-1,6-bisphosphatase 1
Synonyms:
F16P1_MOUSE Fbp1 | Fbp3
Type:
PROTEIN
Mol. Mass.:
36912.07
Organism:
Mus musculus
Description:
ChEMBL_748173
Residue:
338
  
Inhibitor
Name:
BDBM50305586
Synonyms:
CHEMBL589862 | N-(5-bromothiazol-2-ylcarbamoyl)-3,5-dimethylbenzenesulfonamide
Type:
Small organic molecule
Emp. Form.:
C12H12BrN3O3S2
Mol. Mass.:
390.276
SMILES:
Cc1cc(C)cc(c1)S(=O)(=O)NC(=O)Nc1ncc(Br)s1
: