Target
Coagulation factor X
Ligand
BDBM50306148
Substrate
Meas. Tech.
ChEMBL_606078 (CHEMBL1071977)
Ki
1.5±n/a nM
Citation
 Kleanthous, SBorthwick, ADBrown, DBurns-Kurtis, CLCampbell, MChaudry, LChan, CClarte, MOConvery, MAHarling, JDHortense, EIrving, WRIrvine, SPateman, AJPatikis, ANPinto, ILPollard, DRRoethka, TJSenger, SShah, GPStelman, GJToomey, JRWatson, NSWest, RIWhittaker, CZhou, PYoung, RJ Structure and property based design of factor Xa inhibitors: pyrrolidin-2-ones with monoaryl P4 motifs. Bioorg Med Chem Lett 20:618-22 (2010)  
Target
Name:
Coagulation factor X
Synonyms:
Activated coagulation factor X (FXa) Coagulation factor X precursor F10 Factor X heavy chain Factor Xa Stuart-Prower factor
Type:
Enzyme
Mol. Mass.:
54726.60
Organism:
Homo sapiens (Human)
Description:
Residue:
488
  
Inhibitor
Name:
BDBM50306148
Synonyms:
(S)-4-(3-(2-(5-chlorothiophen-2-yl)vinylsulfonamido)-2-oxopyrrolidin-1-yl)-3-fluoro-N,N-dimethylbenzamide GTC000101A
Type:
Small organic molecule
Emp. Form.:
C19H19ClFN3O4S2
Mol. Mass.:
471.953
SMILES:
CN(C)C(=O)c1ccc(N2CC[C@H](NS(=O)(=O)\C=C\c3ccc(Cl)s3)C2=O)c(F)c1
: