Target
Prostaglandin G/H synthase 1
Ligand
BDBM50306353
Substrate
Meas. Tech.
ChEMBL_609605 (CHEMBL1065220)
IC50
33500±n/a nM
Citation
 Ghodsi, RZarghi, ADaraei, BHedayati, M Design, synthesis and biological evaluation of new 2,3-diarylquinoline derivatives as selective cyclooxygenase-2 inhibitors. Bioorg Med Chem 18:1029-33 (2010)  
Target
Name:
Prostaglandin G/H synthase 1
Synonyms:
COX1 Cyclooxygenase-1 (COX-1) PTGS1 | Prostaglandin G/H synthase (cyclooxygenase)
Type:
Protein
Mol. Mass.:
68868.60
Organism:
Ovis aries (Sheep)
Description:
Residue:
600
  
Inhibitor
Name:
BDBM50306353
Synonyms:
2-(4-(methylsulfonyl)phenyl)-3-phenylquinoline | CHEMBL598330
Type:
Small organic molecule
Emp. Form.:
C22H17NO2S
Mol. Mass.:
359.441
SMILES:
CS(=O)(=O)c1ccc(cc1)-c1nc2ccccc2cc1-c1ccccc1
: