Target
Prostaglandin G/H synthase 2
Ligand
BDBM50306355
Substrate
Meas. Tech.
ChEMBL_609606 (CHEMBL1065221)
IC50
130±n/a nM
Citation
 Ghodsi, RZarghi, ADaraei, BHedayati, M Design, synthesis and biological evaluation of new 2,3-diarylquinoline derivatives as selective cyclooxygenase-2 inhibitors. Bioorg Med Chem 18:1029-33 (2010)  
Target
Name:
Prostaglandin G/H synthase 2
Synonyms:
COX2 Cyclooxygenase-2 (COX-2) PTGS2 Prostaglandin G/H synthase (cyclooxygenase)
Type:
Protein
Mol. Mass.:
68976.98
Organism:
Ovis aries (Sheep)
Description:
Residue:
603
  
Inhibitor
Name:
BDBM50306355
Synonyms:
3,4-diphenyl-2-(4-methylsulfonyl)phenyl)-quinoline | CHEMBL597903
Type:
Small organic molecule
Emp. Form.:
C28H21NO2S
Mol. Mass.:
435.537
SMILES:
CS(=O)(=O)c1ccc(cc1)-c1nc2ccccc2c(-c2ccccc2)c1-c1ccccc1
: