Target
Prostaglandin G/H synthase 2
Ligand
BDBM50306357
Substrate
Meas. Tech.
ChEMBL_609606 (CHEMBL1065221)
IC50
70±n/a nM
Citation
 Ghodsi, RZarghi, ADaraei, BHedayati, M Design, synthesis and biological evaluation of new 2,3-diarylquinoline derivatives as selective cyclooxygenase-2 inhibitors. Bioorg Med Chem 18:1029-33 (2010)  
Target
Name:
Prostaglandin G/H synthase 2
Synonyms:
COX2 Cyclooxygenase-2 (COX-2) PTGS2 Prostaglandin G/H synthase (cyclooxygenase)
Type:
Protein
Mol. Mass.:
68976.98
Organism:
Ovis aries (Sheep)
Description:
Residue:
603
  
Inhibitor
Name:
BDBM50306357
Synonyms:
2-(4-(methylsulfonyl)phenyl)-3-phenylquinoline-4-carboxylic acid | CHEMBL597902
Type:
Small organic molecule
Emp. Form.:
C23H17NO4S
Mol. Mass.:
403.45
SMILES:
CS(=O)(=O)c1ccc(cc1)-c1nc2ccccc2c(C(O)=O)c1-c1ccccc1
: