Target
Cruzipain
Ligand
BDBM50306594
Substrate
Meas. Tech.
ChEMBL_611209 (CHEMBL1065731)
Ki
6760±n/a nM
Citation
 Brak, KKerr, IDBarrett, KTFuchi, NDebnath, MAng, KEngel, JCMcKerrow, JHDoyle, PSBrinen, LSEllman, JA Nonpeptidic tetrafluorophenoxymethyl ketone cruzain inhibitors as promising new leads for Chagas disease chemotherapy. J Med Chem 53:1763-73 (2010)  
Target
Name:
Cruzipain
Synonyms:
CYSP_TRYCR Cruzaine | Major cysteine proteinase
Type:
Protein
Mol. Mass.:
49831.41
Organism:
Trypanosoma cruzi
Description:
P25779
Residue:
467
  
Inhibitor
Name:
BDBM50306594
Synonyms:
3-(4-((S)-3-methyl-2-(quinolin-6-ylmethylamino)butan-2-yl)-1H-1,2,3-triazol-1-yl)-1-(2,3,5,6-tetrafluorophenoxy)butan-2-one | CHEMBL602886
Type:
Small organic molecule
Emp. Form.:
C27H27F4N5O2
Mol. Mass.:
529.5292
SMILES:
CC(C)[C@](C)(NCc1ccc2ncccc2c1)c1cn(nn1)C(C)C(=O)COc1c(F)c(F)cc(F)c1F
: