Target
11-beta-hydroxysteroid dehydrogenase 1
Ligand
BDBM50233538
Substrate
Meas. Tech.
ChEMBL_607151 (CHEMBL1064823)
IC50
90±n/a nM
Citation
 Beseda, ICzollner, LShah, PSKhunt, RGaware, RKosma, PStanetty, CDel Ruiz-Ruiz, MCAmer, HMereiter, KDa Cunha, TOdermatt, AClassen-Houben, DJordis, U Synthesis of glycyrrhetinic acid derivatives for the treatment of metabolic diseases. Bioorg Med Chem 18:433-54 (2010)  
Target
Name:
11-beta-hydroxysteroid dehydrogenase 1
Synonyms:
11-DH 11-beta-Hydroxysteroid Dehydrogenase 1 (11-beta-HSD1) Corticosteroid 11-beta-dehydrogenase isozyme 1 DHI1_RAT Hsd11b1
Type:
Enzyme
Mol. Mass.:
31889.48
Organism:
Rattus norvegicus (rat)
Description:
P16232
Residue:
288
  
Inhibitor
Name:
BDBM50233538
Synonyms:
18beta-glycyrrhetic acid CHEMBL230006 glycyrrhetinic acid
Type:
Small organic molecule
Emp. Form.:
C30H46O4
Mol. Mass.:
470.6838
SMILES:
CC1(C)[C@@H](O)CC[C@@]2(C)[C@H]1CC[C@]1(C)[C@@H]2C(=O)C=C2[C@@H]3C[C@](C)(CC[C@]3(C)CC[C@@]12C)C(O)=O
: