Target
Integrin alpha-4
Ligand
BDBM50309087
Substrate
Meas. Tech.
ChEMBL_608124 (CHEMBL1074813)
IC50
0.110000±n/a nM
Citation
 Reger, TSZunic, JStock, NWang, BSmith, NDMunoz, BGreen, MDGardner, MFJames, JPChen, WAlves, KSi, QTreonze, KMLingham, RBMumford, RA Heterocycle-substituted proline dipeptides as potent VLA-4 antagonists. Bioorg Med Chem Lett 20:1173-6 (2010)  
Target
Name:
Integrin alpha-4
Synonyms:
CD49 antigen-like family member D CD49d antigen ITA4_HUMAN Integrin alpha-4 Integrin alpha-IV VLA-4 integrin alpha 4 precursor | integrin alpha-4 precursor
Type:
Membrane Protein
Mol. Mass.:
114897.35
Organism:
Homo sapiens (Human)
Description:
P13612
Residue:
1032
  
Inhibitor
Name:
BDBM50309087
Synonyms:
(S)-2-((2S,4R)-1-(3-cyanophenylsulfonyl)-4-(piperidin-1-yl)pyrrolidine-2-carboxamido)-3-(4-(3,5-dichloroisonicotinamido)phenyl)propanoic acid | CHEMBL569263
Type:
Small organic molecule
Emp. Form.:
C32H32Cl2N6O6S
Mol. Mass.:
699.604
SMILES:
OC(=O)[C@H](Cc1ccc(NC(=O)c2c(Cl)cncc2Cl)cc1)NC(=O)[C@@H]1C[C@H](CN1S(=O)(=O)c1cccc(c1)C#N)N1CCCCC1
: