Target
Integrin alpha-4
Ligand
BDBM50309094
Substrate
Meas. Tech.
ChEMBL_608130 (CHEMBL1074819)
IC50
0.160000±n/a nM
Citation
 Reger, TSZunic, JStock, NWang, BSmith, NDMunoz, BGreen, MDGardner, MFJames, JPChen, WAlves, KSi, QTreonze, KMLingham, RBMumford, RA Heterocycle-substituted proline dipeptides as potent VLA-4 antagonists. Bioorg Med Chem Lett 20:1173-6 (2010)  
Target
Name:
Integrin alpha-4
Synonyms:
CD49 antigen-like family member D CD49d antigen ITA4_HUMAN Integrin alpha-4 Integrin alpha-IV VLA-4 integrin alpha 4 precursor | integrin alpha-4 precursor
Type:
Membrane Protein
Mol. Mass.:
114897.35
Organism:
Homo sapiens (Human)
Description:
P13612
Residue:
1032
  
Inhibitor
Name:
BDBM50309094
Synonyms:
(S)-2-((2S,4R)-1-(3-cyanophenylsulfonyl)-4-(4-methylpiperidin-1-yl)pyrrolidine-2-carboxamido)-3-(4-(3,5-dichloroisonicotinamido)phenyl)propanoic acid | CHEMBL601896
Type:
Small organic molecule
Emp. Form.:
C33H34Cl2N6O6S
Mol. Mass.:
713.631
SMILES:
CC1CCN(CC1)[C@@H]1C[C@H](N(C1)S(=O)(=O)c1cccc(c1)C#N)C(=O)N[C@@H](Cc1ccc(NC(=O)c2c(Cl)cncc2Cl)cc1)C(O)=O
: