Target
Phospholipase A-2-activating protein
Ligand
BDBM41890
Substrate
Meas. Tech.
ChEMBL_610122 (CHEMBL1074487)
IC50
800±n/a nM
Citation
 Lanier, MSergienko, ESimão, AMSu, YChung, TMillán, JLCashman, JR Design and synthesis of selective inhibitors of placental alkaline phosphatase. Bioorg Med Chem 18:573-9 (2010)  
Target
Name:
Phospholipase A-2-activating protein
Synonyms:
PLAA PLAP_HUMAN
Type:
PROTEIN
Mol. Mass.:
87154.11
Organism:
Homo sapiens (Human)
Description:
ChEMBL_610122
Residue:
795
  
Inhibitor
Name:
BDBM41890
Synonyms:
2-(1-benzimidazolyl)-1-(3,4-dihydroxyphenyl)ethanone;hydrochloride 2-(benzimidazol-1-yl)-1-[3,4-bis(oxidanyl)phenyl]ethanone;hydrochloride MLS-0315853.0001 | cid_25067493
Type:
Small organic molecule
Emp. Form.:
C15H12N2O3
Mol. Mass.:
268.2674
SMILES:
Oc1ccc(cc1O)C(=O)Cn1cnc2ccccc12
: