Target
Phospholipase A-2-activating protein
Ligand
BDBM41887
Substrate
Meas. Tech.
ChEMBL_610122 (CHEMBL1074487)
IC50
2100±n/a nM
Citation
 Lanier, MSergienko, ESimão, AMSu, YChung, TMillán, JLCashman, JR Design and synthesis of selective inhibitors of placental alkaline phosphatase. Bioorg Med Chem 18:573-9 (2010)  
Target
Name:
Phospholipase A-2-activating protein
Synonyms:
PLAA PLAP_HUMAN
Type:
PROTEIN
Mol. Mass.:
87154.11
Organism:
Homo sapiens (Human)
Description:
ChEMBL_610122
Residue:
795
  
Inhibitor
Name:
BDBM41887
Synonyms:
1-(3,4-dihydroxyphenyl)-2-(1-imidazolyl)ethanone;hydrochloride 1-(3,4-dihydroxyphenyl)-2-imidazol-1-ylethanone;hydrochloride CHEMBL349641 cid_25067472 | cid_52780
Type:
Small organic molecule
Emp. Form.:
C11H10N2O3
Mol. Mass.:
218.2087
SMILES:
Oc1ccc(cc1O)C(=O)Cn1ccnc1
: