Target
Phospholipase A-2-activating protein
Ligand
BDBM50309578
Substrate
Meas. Tech.
ChEMBL_610122 (CHEMBL1074487)
IC50
51200±n/a nM
Citation
 Lanier, MSergienko, ESimão, AMSu, YChung, TMillán, JLCashman, JR Design and synthesis of selective inhibitors of placental alkaline phosphatase. Bioorg Med Chem 18:573-9 (2010)  
Target
Name:
Phospholipase A-2-activating protein
Synonyms:
PLAA PLAP_HUMAN
Type:
PROTEIN
Mol. Mass.:
87154.11
Organism:
Homo sapiens (Human)
Description:
ChEMBL_610122
Residue:
795
  
Inhibitor
Name:
BDBM50309578
Synonyms:
4-((4,6-dimethylpyrimidin-2-ylamino)methyl)benzene-1,2-diol cid_25199537
Type:
Small organic molecule
Emp. Form.:
C13H15N3O2
Mol. Mass.:
245.2771
SMILES:
Cc1cc(C)nc(NCc2ccc(O)c(O)c2)n1
: