Target
Polyphenol oxidase 2
Ligand
BDBM26190
Substrate
Meas. Tech.
ChEMBL_618469 (CHEMBL1100455)
IC50
4210000±n/a nM
Citation
 Ngoc, TMLee, IHa, do TKim, HMin, BBae, K Tyrosinase-inhibitory constituents from the twigs of Cinnamomum cassia. J Nat Prod 72:1205-8 (2009)  
Target
Name:
Polyphenol oxidase 2
Synonyms:
Monophenol monooxygenase PPO2 Tyrosinase
Type:
Protein
Mol. Mass.:
63923.66
Organism:
Agaricus bisporus (Common mushroom)
Description:
O42713
Residue:
556
  
Inhibitor
Name:
BDBM26190
Synonyms:
1,4-Dihydroxybenzene, XIII CHEMBL537 Hydroquinone, HQ phenol derivative, 4
Type:
Small organic molecule
Emp. Form.:
C6H6O2
Mol. Mass.:
110.1106
SMILES:
Oc1ccc(O)cc1
: