Target
Sialidase-2
Ligand
BDBM23411
Substrate
Meas. Tech.
ChEMBL_617801 (CHEMBL1100507)
IC50
55000±n/a nM
Citation
 Arioka, SSakagami, MUematsu, RYamaguchi, HTogame, HTakemoto, HHinou, HNishimura, S Potent inhibitor scaffold against Trypanosoma cruzi trans-sialidase. Bioorg Med Chem 18:1633-40 (2010)  
Target
Name:
Sialidase-2
Synonyms:
Cytosolic sialidase NEU2 Sialidase 2 | Sialidase-2
Type:
PROTEIN
Mol. Mass.:
42256.20
Organism:
Homo sapiens (Human)
Description:
ChEMBL_960638
Residue:
380
  
Inhibitor
Name:
BDBM23411
Synonyms:
5,6,7-trihydroxy-2-(4-hydroxyphenyl)-4H-chromen-4-one Scutellarein Scutellarein (28) | US10252984, Table 2.2
Type:
flavone
Emp. Form.:
C15H10O6
Mol. Mass.:
286.2363
SMILES:
Oc1ccc(cc1)-c1cc(=O)c2c(O)c(O)c(O)cc2o1
: