Target
Death-associated protein kinase 3
Ligand
BDBM50314668
Substrate
Meas. Tech.
ChEMBL_625624 (CHEMBL1112575)
IC50
346.1±n/a nM
Citation
 Okamoto, MTakayama, KShimizu, TMuroya, AFuruya, T Structure-activity relationship of novel DAPK inhibitors identified by structure-based virtual screening. Bioorg Med Chem 18:2728-34 (2010)  
Target
Name:
Death-associated protein kinase 3
Synonyms:
DAP kinase 3 DAPK3 ZIP-kinase | ZIPK
Type:
PROTEIN
Mol. Mass.:
52537.07
Organism:
Homo sapiens (Human)
Description:
ChEMBL_586564
Residue:
454
  
Inhibitor
Name:
BDBM50314668
Synonyms:
2-(3,4-difluorophenyl)-4-(pyridin-3-ylmethylene)oxazol-5(4H)-one | CHEMBL1091764
Type:
Small organic molecule
Emp. Form.:
C15H8F2N2O2
Mol. Mass.:
286.233
SMILES:
Fc1ccc(cc1F)C1=N\C(=C/c2cccnc2)C(=O)O1
: